Re: [xml] Release of libxml2-2.5.3

I could build the new version from the rpm-file on RedHat 8.0 (and Windows ) but it
was not possible under RedHat 6.2 (python-devel-1.5.2-13).
I tried also a 'configure --without-python' but the result was the same:
The build is always aborted with the following error messages:

cd . && /usr/bin/python
Found 1132 functions in libxml2-api.xml
Found 45 functions in libxml2-python-api.xml
Generated 700 wrapper functions, 293 failed, 184 skipped

Missing type converters:
xmlGenericErrorFunc *:1 xlinkType:1 const htmlElemDesc *:1 xmlNotationPtr:1 xmlElementContentPtr:4 xmlTextReaderErrorFunc *:1 void *:44 xmlElementContent *:1 xmlAttributeType:1 xmlCatalogAllow:2 xmlElementContentType:1 xmlXPathFunction:4 xmlIDTablePtr:1 xmlRegisterNodeFunc:1 xmlEntitiesTablePtr:3 xmlParserInputPtr:17 xmlNodeSetPtr:32 xmlCharEncoding:12 xmlParserNodeInfoSeqPtr:3 char **:5 htmlStatus:1 xmlOutputWriteCallback:1 xmlInputReadCallback:1 xmlAutomataPtr:15 xmlCharEncodingInputFunc:1 xmlNodePtr *:1 xmlCharEncodingHandlerPtr:7 htmlElemDesc *:3 xmlRegExecCtxtPtr:2 xmlShellReadlineFunc:1 xmlXPathFuncLookupFunc:1 xmlCatalogPrefer:1 xmlDeregisterNodeFunc:1 xmlC14NIsVisibleCallback:1 xmlValidCtxtPtr:23 xlinkHandlerPtr:2 const xmlParserNodeInfo *:1 xmlRelaxNGValidityErrorFunc:2 xmlElementContentPtr *:1 xmlParserNodeInfoPtr:1 xmlRefTablePtr:1 xlinkNodeDetectFunc:2 xmlShellCtxtPtr:10 xmlXPathVariableLookupFunc:1 xmlNotationTablePtr:2 xmlNsPtr *:1 xmlEnumerationPtr *:2 xmlBufferAllocationScheme:2 size_t:1 xmlAttributeTablePtr:2 xmlEntityReferenceFunc:1 xmlExternalEntityLoader:2 xmlOutputMatchCallback:1 xmlTextReaderErrorFunc:1 xmlXPathCompExprPtr:4 xmlChar **:14 const htmlEntityDesc *:2 xmlElementTablePtr:2 xmlEnumerationPtr:5 xmlCharEncodingHandler *:4 xmlLocationSetPtr:6 xmlInputMatchCallback:1 xmlRegExecCallbacks:1 xmlXPathObjectPtr:22
Traceback (innermost last):
 File "", line 1134, in ?
 File "", line 1092, in buildWrappers
   if pref[0] == ref[0]:
NameError: ref
make[3]: *** [gen_prog] Error 1
make[3]: Leaving directory `/home/src/redhat/BUILD/libxml2-2.5.3/python'
make[2]: *** [all-recursive] Error 1
make[2]: Leaving directory `/home/src/redhat/BUILD/libxml2-2.5.3/python'
make[1]: *** [all-recursive] Error 1
make[1]: Leaving directory `/home/src/redhat/BUILD/libxml2-2.5.3'
make: *** [all-recursive-am] Error 2
error: Bad exit status from /var/tmp/rpm-tmp.32935 (%build)

RPM build errors:
   Bad exit status from /var/tmp/rpm-tmp.32935 (%build)

Dr. Günter Schmidt | Bruker BioSpin GmbH | NMR Software Department E-Mail: Guenter Schmidt Bruker DE | Silberstreifen Phone: +49 721 5161-443 / Fax:-480 | D-76287 Rheinstetten

Attachment: smime.p7s
Description: S/MIME Cryptographic Signature

[Date Prev][Date Next]   [Thread Prev][Thread Next]   [Thread Index] [Date Index] [Author Index]