[Gtk-osx-users] Build issues: codegen for igemacintegration

I get this error while trying to build ige-mac-integration-python:

*** Building ige-mac-integration-python *** [16/17]
make  all-recursive
Making all in src
make[2]: Nothing to be done for `all'.
Making all in data
make[2]: Nothing to be done for `all'.
Making all in bindings
Making all in python
/usr/bin/python ~/gtk/inst/share/pygtk/2.0/codegen/h2def.py ../../src/ige-mac-menu.h ../../src/ige-mac-dock.h ../../src/ige-mac-bundle.h > igemacintegration.defs
/System/Library/Frameworks/Python.framework/Versions/2.5/Resources/Python.app/Contents/MacOS/Python: can't open file '~/gtk/inst/share/pygtk/2.0/codegen/h2def.py': [Errno 2] No such file or directory
make[3]: *** [igemacintegration.defs] Error 2
make[2]: *** [all-recursive] Error 1
make[1]: *** [all-recursive] Error 1
make: *** [all] Error 2
*** Error during phase build of ige-mac-integration-python: ########## Error running make   *** [16/17]

  [1] Rerun phase build
  [2] Ignore error and continue to install
  [3] Give up on module
  [4] Start shell
  [5] Reload configuration
  [6] Go to phase force_checkout
  [7] Go to phase configure
  [8] Go to phase clean
  [9] Go to phase distclean

Choosing [1] gave the impression of working, but the module doesn't
actually work.  igemacintegration._igemacintegration doesn't actually
contain anything.

Any ideas?


Recently on my blog:

[Date Prev][Date Next]   [Thread Prev][Thread Next]   [Thread Index] [Date Index] [Author Index]