Re: Error compiling Cairo 0.92 and how to fix it

Congratulations Torsten! I tested your patch and it works very well: nmake runs without any errors.

By the way: I forgot to mention that "nmake test" returns some errors during its run. This is the output:

C:\Cairo-0.92>nmake test

Microsoft (R) Program Maintenance Utility, Version 7.10.3077
Copyright (C) Microsoft Corporation. Alle Rechte vorbehalten.

C:\usr\bin\perl.exe "-MExtUtils::Command::MM" "-e" "test_harness(0, 'bli
b\lib', 'blib\arch')" t/*.t
t/Cairo...........ok 1/56Free to wrong pool 224218 not 801ae at t/Cairo.t line 1
        Test returned status 5 (wstat 1280, 0x500)
DIED. FAILED tests 30-56
        Failed 27/56 tests, 51.79% okay
t/CairoFont.......ok 1/20Free to wrong pool 224218 not 80173 at t/CairoFont.t li
ne 68.
        Test returned status 5 (wstat 1280, 0x500)
DIED. FAILED tests 14-20
        Failed 7/20 tests, 65.00% okay
t/CairoSurface....ok 1/60Free to wrong pool 224218 not c018c at t/CairoSurface.t
 line 95.
        Test returned status 5 (wstat 1280, 0x500)
DIED. FAILED tests 20-60
        Failed 41/60 tests, 31.67% okay
Failed Test      Stat Wstat Total Fail  Failed  List of Failed
t/Cairo.t           5  1280    56   54  96.43%  30-56
t/CairoFont.t       5  1280    20   14  70.00%  14-20
t/CairoSurface.t    5  1280    60   82 136.67%  20-60
Failed 3/6 test scripts, 50.00% okay. 75/167 subtests failed, 55.09% okay.
NMAKE : fatal error U1077: 'C:\usr\bin\perl.exe': R³ckgabe-Code '0x5'

It would be great if you checked the output to verify that it is not caused by the fact that SVG is not present (which was mentioned by you some posts before).

Mario Fischer

[Date Prev][Date Next]   [Thread Prev][Thread Next]   [Thread Index] [Date Index] [Author Index]