Re: [gtk-osx-users] gtksourceview3: file hash is incorrect.

Hello John,

Well, no problem with delay, you do it for free :-)

In fact, i'm glad to hear you as I've got problem again with gtksourceview3:

cmd$ jhbuild build gtksourceview3
*** Checking out gtksourceview3 *** [1/1]
*** Configuring gtksourceview3 *** [1/1] --prefix /usr/local/xnadalib-2017   
***Warning*** $srcdir is not defined, out of dir autogen is broken!
 checking for automake >= 1.11.2...
   testing automake...  found 1.14.1
 checking for autoreconf >= 2.53...
   testing autoreconf...  found 2.69
 checking for gtk-doc >= 1.0...
   testing gtkdocize...  found 1.25
 Checking for required M4 macros...
  Processing ./
  Running gtkdocize...
  Running autoreconf...
 autoreconf: Entering directory `.'
autoreconf: running: autopoint --force
autoreconf: running: aclocal --force --warnings=no-portability error: macro VAPIGEN_CHECK is not defined; is a m4 file missing?
/usr/local/xnadalib-2017/share/aclocal/ax_require_defined.m4:37: AX_REQUIRE_DEFINED is expanded from... the top level
autom4te: /usr/bin/m4 failed with exit status: 1
aclocal: error: echo failed with exit status: 1
autoreconf: aclocal failed with exit status: 1
*** Error during phase configure of gtksourceview3: ########## Error running --prefix 
/usr/local/xnadalib-2017    *** [1/1]

I choose ignore, but the error is not recovered so I can't build yet gtksourceview3.

Thanks, Pascal.

Le 6 sept. 2017 à 16:34, John Ralls <jralls ceridwen us> a écrit :

On Aug 29, 2017, at 1:17 PM, Pascal <p p14 orange fr> wrote:


After a fresh install of gtk-osx on MacOS 10.11 with GTK+3:
cmd$ jhbuild build meta-gtk-osx-gtk3

when I built gtksourceview3, I’ve got an error:

cmd$ jhbuild build gtksourceview3
*** Checking out gtksourceview3 *** [1/1]
curl --continue-at - -L -o 
% Total    % Received % Xferd  Average Speed   Time    Time     Time  Current
                               Dload  Upload   Total   Spent    Left  Speed
100 1588k  100 1588k    0     0   895k      0  0:00:01  0:00:01 --:--:--  895k
*** Error during phase checkout of gtksourceview3: file hash is incorrect (expected 
7bbe8b603ed7346669911fa074fe69388a4c89c1b15317befc3aa212b3d01a7b, got 
717b6fe884ff9f25158bdc36f463790c608ada9f5e2e6f4dc7f1467c83711c25) *** [1/1]

[1] Rerun phase checkout
[2] Ignore error and continue to configure
[3] Give up on module
[4] Start shell
[5] Reload configuration
[6] Go to phase "wipe directory and start over"
choice: 2

I choose ignore, but the error is not recovered so I can't build gtksourceview3.

Both fixed, thanks for reporting them and sorry for the delay.

Ignoring the second one didn’t work because the file hadn’t been untarred, which is part of the checkout 

John Ralls

[Date Prev][Date Next]   [Thread Prev][Thread Next]   [Thread Index] [Date Index] [Author Index]