[Gtk-osx-users] jhbuild bootstrap: guile linking error

I decided to compile a new version for gtk-osx. Gtk+-2.18.2 is 
installed. I didn't remove the old folder "gtk".

So I did

$ sh gtk-osx-build-setup.sh
$ export PATH="$PATH:Users/zdia/.local/bin/"
$ ~/.local/bin/jhbuild shell
$ jhbuild bootstrap

But I've got the following error message during the build of guile:

*** Checking out guile *** [11/13]
*** Building guile *** [11/13]
/bin/sh ./libtool --tag=CC   --mode=link gcc  -g -O2 -version-info 
17:3:0 -export-dynamic -no-undefined -L/opt/gnome2/lib  -o 
libguilereadline-v-17.la -rpath /opt/gnome2/lib readline.lo 
../libguile/libguile.la -lreadline -lncurses

gcc -dynamiclib  -o .libs/libguilereadline-v- 
.libs/readline.o  -L/opt/gnome2/lib ../libguile/.libs/libguile.dylib 
/opt/gnome2/lib/libintl.dylib /opt/gnome2/lib/libgmp.dylib 
/opt/gnome2/lib/libltdl.dylib -lreadline -lncurses  -install_name 
/opt/gnome2/lib/libguilereadline-v-17.17.dylib -compatibility_version 18 
-current_version 18.3 -Wl,-single_module

Undefined symbols:
   "_rl_get_keymap_name", referenced from:
       _scm_init_readline in readline.o
ld: symbol(s) not found

collect2: ld returned 1 exit status
make[4]: *** [libguilereadline-v-17.la] Error 1
make[3]: *** [all-recursive] Error 1
make[2]: *** [all] Error 2
make[1]: *** [all-recursive] Error 1
make: *** [all] Error 2
*** Error during phase build of guile: ########## Error running make 
*** [11/13]

[Date Prev][Date Next]   [Thread Prev][Thread Next]   [Thread Index] [Date Index] [Author Index]