Possible bug?

This one has cropped up on my system in the last few CVS updates...since
1.1.9, I believe.  I think it's glib related, hopefully someone has some

First:  System specs...P166, Slack3.4 heavily modified to do glibc2, gcc, gtk/glib/etc all fresh from CVS

The error crops up when compiling anything that looks at glib.h...

-I../support -I../support -I../intl -I../intl -I/usr/local/include
-I/usr/local/lib/glib/include -I/usr/local/include -I/usr/X11R6/include
-I/usr/local/lib/glib/include -I/usr/local/include -I/usr/local/include
-I/usr/X11R6/include -DGNOMELIBDIR=\"/usr/local/lib\"
-DGNOMEDATADIR=\"/usr/local/share\" -DGNOMEBINDIR=\"/usr/local/bin\"
-DGNOMESYSCONFDIR=\"/usr/local/etc\" -DVERSION=\"0.99.1\"
-I/usr/X11R6/include -I/usr/local/lib/glib/include -I/usr/local/include -g
-O2 -Wall -Wno-unused -Wmissing-prototypes -Wmissing-declarations
-Wpointer-arith -Wp,-MD,.deps/gnome-config.p -c -fPIC -DPIC gnome-config.c
In file included from gnome-config.c:30:
/usr/local/include/glib.h:2302: parse error before `GLIB_SYSDEF_POLLIN'
make[2]: *** [gnome-config.lo] Error 1
make[2]: Leaving directory `/usr/local/src/gnome/gnome-libs/libgnome'
make[1]: *** [all-recursive] Error 1
make[1]: Leaving directory `/usr/local/src/gnome/gnome-libs'
make: *** [all-recursive-am] Error 2

hopefully someone has an idea.


[Date Prev][Date Next]   [Thread Prev][Thread Next]   [Thread Index] [Date Index] [Author Index]