'make' compilation error with gnopernicus

Hey all,

First of all, I'de like to thank Adi Dascal for pointing this forum out to me. Second of all, I have run into a problem I need a little help with.

I'm trying to build gnopernicus on a redhat 8.1 Beta box with gnome2.2. I have gotten to the point where I am running 'make' in the gnopernicus directory, and am getting a couple of errors that I don't quite understand. Following are the errors.

collect2: ld returned 1 exit status
make[3]: *** [tester] Error 1
make[3]: Leaving directory `/opt/gnopernicus_install_files/gnopernicus/braille/test'
make[2]: *** [all-recursive] Error 1
make[2]: Leaving directory `/opt/gnopernicus_install_files/gnopernicus/braille'
make[1]: *** [all-recursive] Error 1
make[1]: Leaving directory `/opt/gnopernicus_install_files/gnopernicus'
make: *** [all-recursive-am] Error 2

Anybody have any ideas?  Any input will be appreciated.  Thanks in advance.

STOP MORE SPAM with the new MSN 8 and get 2 months FREE* http://join.msn.com/?page=features/junkmail

[Date Prev][Date Next]   [Thread Prev][Thread Next]   [Thread Index] [Date Index] [Author Index]