[Evolution] Make error...

I am trying to build Evolution from CVS and am encountering this error:

Making all in config
make[3]: Entering directory `/opt/evolution/evolution/default_user/config'
make[3]: *** No rule to make target `all'.  Stop.
make[3]: Leaving directory `/opt/evolution/evolution/default_user/config'
make[2]: *** [all-recursive] Error 1
make[2]: Leaving directory `/opt/evolution/evolution/default_user'
make[1]: *** [all-recursive] Error 1
make[1]: Leaving directory `/opt/evolution/evolution'
make: *** [all-recursive-am] Error 2

There is no Makefile in default_user/config:

[ujwal kurukshetra evolution]$ ls /opt/evolution/evolution/default_user/config
CVS/  Makefile.am

bug, CVS sync issue, that damned gettext thing?



[Date Prev][Date Next]   [Thread Prev][Thread Next]   [Thread Index] [Date Index] [Author Index]