Re: [Evolution] Problem installing Oaf

Dan Winship <danw helixcode com> writes:

FAIL: oaf-test-client
1 of 1 tests failed
make[2]: *** [check-TESTS] Error 1
make[2]: Leaving directory `/root/packages/evolution/oaf-0.6.0/test'
make[1]: *** [check-am] Error 2
make[1]: Leaving directory `/root/packages/evolution/oaf-0.6.0/test'
make: *** [check-recursive] Error 1

Hey, wow, that happens for me too. Looks like maybe oaf's tests are

I'd say just install it and keep building and see if everything works
at the end.

A number of the tests seem to be broken intermittently for me. Neither
I nor Michael (who wrote most of the tests) have determined what
causes it so far. I do get them to pass often enough to be able to
`make distcheck' for a release...

 - Maciej

[Date Prev][Date Next]   [Thread Prev][Thread Next]   [Thread Index] [Date Index] [Author Index]