[Evolution] cvs compile error

I am not able to compile from CVS I get the following error:

/addressbook/backend/pas/libpas.a(pas-backend-file.o): In function `pas_backend_file_load_uri': /tmp/evolution/addressbook/backend/pas/pas-backend-file.c:1211: undefined reference to `__db185_open' /tmp/evolution/addressbook/backend/pas/pas-backend-file.c:1213: undefined reference to `__db185_open'
collect2: ld returned 1 exit status
make[2]: *** [wombat] Error 1
make[2]: Leaving directory `/tmp/evolution/wombat'
make[1]: *** [all-recursive] Error 1
make[1]: Leaving directory `/tmp/evolution'
make: *** [all-recursive-am] Error 2

any help would be appreciated.


[Date Prev][Date Next]   [Thread Prev][Thread Next]   [Thread Index] [Date Index] [Author Index]