[Evolution-hackers] EDS 3.8.1 build problem

Hi, I'm trying to upgrade my evolution from 3.6.x to 3.8.x and I get the build brake at the tests.
See below:

Making all in libebook-contacts
make[3]: Entering directory `/tmp/DLG/work/evolution-data-server-3.8.1-1/evolution-data-server-3.8.1/tests/libebook-contacts'
  CC       test_contact_types-test-contact-types.o
  CCLD     test-contact-types
../../addressbook/libebook-contacts/.libs/libebook-contacts-1.2.so: undefined reference to `e_enum_from_string'
../../addressbook/libebook-contacts/.libs/libebook-contacts-1.2.so: undefined reference to `e_enum_to_string'
collect2: error: ld returned 1 exit status
make[3]: *** [test-contact-types] Error 1
make[3]: Leaving directory `/tmp/DLG/work/evolution-data-server-3.8.1-1/evolution-data-server-3.8.1/tests/libebook-contacts'
make[2]: *** [all-recursive] Error 1
make[2]: Leaving directory `/tmp/DLG/work/evolution-data-server-3.8.1-1/evolution-data-server-3.8.1/tests'
make[1]: *** [all-recursive] Error 1
make[1]: Leaving directory `/tmp/DLG/work/evolution-data-server-3.8.1-1/evolution-data-server-3.8.1'
make: *** [all] Error 2

I attach the configure log also. If needed I can also send the make log.

Any idea of what is wrong here ?


Attachment: configure.txt
Description: Text document

[Date Prev][Date Next]   [Thread Prev][Thread Next]   [Thread Index] [Date Index] [Author Index]