Re: Build error in nautilus

On Mon, 2007-12-03 at 02:19 +0100, Kjartan Maraas wrote:
> Hi.
> I came across this build failure in the 2.22 jhbuild this evening:
> nautilus-file-operations.c: In function 'move_file_prepare':
> nautilus-file-operations.c:5803: error: 'G_FILE_COPY_NO_FALLBACK_FOR_MOVE' undeclared (first use in this function)
> nautilus-file-operations.c:5803: error: (Each undeclared identifier is reported only once
> nautilus-file-operations.c:5803: error: for each function it appears in.)
> make[2]: Leaving directory `/home/kmaraas/cvs/gnome/nautilus/libnautilus-private'
> make[1]: Leaving directory `/home/kmaraas/cvs/gnome/nautilus'
> make[2]: *** [nautilus-file-operations.lo] Error 1
> make[1]: *** [all-recursive] Error 1
> make: *** [all] Error 2

[Brown paper bag on head] Yeah. I forgot to commit this, should work
with latest glib now.

[Date Prev][Date Next]   [Thread Prev][Thread Next]   [Thread Index] [Date Index] [Author Index]