Nautilus 2.10.0 Won't Compile

Hi! This is my first time compiling gnome, and nautilus is not building. I 
have already compiled:
atk 1.9.0
eel 2.10.0
GConf 2.10.0
gcond-editor 2.10.0
glib 2.6.3
gnome backgrounds 2.10.0
gnome desktop 2.10.0
gnome icon themes 2.10.0
gnome panel 2.10.0
gnome session 2.10.0
gnome themes 2.10.0
gnome utils 2.10.0
gnome vfs 2.10.0
gtk+ 2.6.4
gtk engines 2.6.2
libbonobo 2.8.1
libbonoboui 2.8.1
libglade 2.5.1
libgnome 2.10.0
libgnomecanvas 2.10.0
libgnomecups 0.2.0
libgnomeprint 2.10.0
libgnomeui 2.10.0
librsvg 2.9.5
libwnck 2.10.0
libxklavier 2.0
metacity 2.10.0
pango 1.8.1
(alphabetical order, not ordered by when compiled)
That might sound like a lot, but I don't want to leave anything out. I run 
Mandrake 10.1 (gnome 2.6), and before I started, I removed almost any trace 
of gnome (ran kde), and left just to support running the gtk2 based control 
center. Nautilus fails with this message:
nautilus-application.o(.text+0xb1d): In function `end_startup_notification':
undefined reference to `sn_launchee_context_get_id_has_timestamp'
undefined reference to `sn_launchee_context_get_timestamp'
collect2: ld returned 1 exit status
make[4]: *** [nautilus] Error 1
make[4]: Leaving directory 
make[3]: *** [all-recursive] Error 1
make[3]: Leaving directory 
make[2]: *** [all] Error 2
make[2]: Leaving directory 
make[1]: *** [all-recursive] Error 1
make[1]: Leaving directory 
make: *** [all] Error 2
[steven localhost nautilus-2.10.0]$

As you can see, there is no '*.h: No such file or directory' message. I am no 
newb to compiling, and have compiled KDE and the linux kernel many times, but 
have always used RPMs for gnome. Any advice? Thanks!

[Date Prev][Date Next]   [Thread Prev][Thread Next]   [Thread Index] [Date Index] [Author Index]