[Nautilus-list] 1.0.4 compilation error - fails in test

Hi, I am trying to build nautilus rpm's on my machine and run into these
compilation problems... any suggestions?  thanks.

make[2]: Nothing to be done for `check'.
make[2]: Leaving directory
make[2]: Entering directory `/usr/src/redhat/BUILD/nautilus-1.0.4/src'
make  check-TESTS
make[3]: Entering directory `/usr/src/redhat/BUILD/nautilus-1.0.4/src'

GnomeUI-WARNING **: While connecting to session manager:
Authentication Rejected, reason : None of the authentication protocols
 are supported and host-based authentication failed.
./check-nautilus: line 2: 26773 Aborted                 (core
dumped) ./nautilus
 --check --g-fatal-warnings
FAIL: check-nautilus
1 of 1 tests failed
make[3]: *** [check-TESTS] Error 1
make[3]: Leaving directory `/usr/src/redhat/BUILD/nautilus-1.0.4/src'
make[2]: *** [check-am] Error 2
make[2]: Leaving directory `/usr/src/redhat/BUILD/nautilus-1.0.4/src'
make[1]: *** [check-recursive] Error 1
make[1]: Leaving directory `/usr/src/redhat/BUILD/nautilus-1.0.4/src'
make: *** [check-recursive] Error 1
error: Bad exit status from /var/tmp/rpm-tmp.86468 (%build)

Josh "Yoshi" Steiner - josh xiphoidprocess com - http://eds.org/~joschi 

Xiphoid Process Records - http://xiphoidprocess.com
San Francisco based electronic music.

[Date Prev][Date Next]   [Thread Prev][Thread Next]   [Thread Index] [Date Index] [Author Index]