Re: Compiling under OS X 10.4 got an error

Hi Russ,

On Wed, 2006-01-25 at 21:35 -0600, Russ Urquhart wrote:
mountlist.c: In function `get_fs_usage':
mountlist.c:772: error: storage size of `fsd' isn't known
make[2]: *** [mountlist.o] Error 1
make[1]: *** [all-recursive] Error 1
make: *** [all] Error 2

I've no idea about the actual fix but I assume the
AC_CHECK_FUNCS(statvfs) around line 500 in acinclude.m4 is involved in
the problem. Others might be able help you out with the details.


mount -t life -o ro /dev/dna /genetic/research

[Date Prev][Date Next]   [Thread Prev][Thread Next]   [Thread Index] [Date Index] [Author Index]