trouble while cross-compiling gtk+-2.10.13

Hello list,

at the moment I have some trouble while compiling gtk+-2.10.13 for an ARM processor. I think nearly at the end of the compile process there is a problem with the demos. One solution could be to compile without the demos, but I haven`t found a switch to turn of the demos.

Eventually there is another more "perfect" solution for this problem.

Here is my compile-output:


Making all in demos
make[3]: Betrete Verzeichnis '/home/project/src/gtk+-2.10.13/demos'
no --raw --build-list        \
            apple_red  ./apple-red.png    \
                gnome_foot ./gnome-foot.png    \
> test-inline-pixbufs.h                \
    || (rm -f test-inline-pixbufs.h && false)
/bin/bash: no: Command not found.
make[3]: *** [test-inline-pixbufs.h] Fehler 1
make[3]: Verlasse Verzeichnis '/home/project/src/gtk+-2.10.13/demos'
make[2]: *** [all-recursive] Fehler 1
make[2]: Verlasse Verzeichnis '/home/project/src/gtk+-2.10.13'
make[1]: *** [all] Fehler 2
make[1]: Verlasse Verzeichnis '/home/project/src/gtk+-2.10.13'
make: *** [/home/project/src/gtk+-2.10.13/Makefile] Fehler 2


Thanks for any help!

Best regards

Dominik Schröder

[Date Prev][Date Next]   [Thread Prev][Thread Next]   [Thread Index] [Date Index] [Author Index]