Re: libgda-3.1.1 compile bust

On Thu, 2007-10-11 at 21:00 -0400, Louis E Garcia II wrote:
Trying to compile on fedora 8:

*** Warning: Linking the executable virtual-test against the loadable
*** is not portable!
gcc -O2 -g -pipe -Wall -Wp,-D_FORTIFY_SOURCE=2 -fexceptions
-fstack-protector --param=ssp-buffer-size=4 -m32 -march=i386
-mtune=generic -fasynchronous-unwind-tables -o .libs/virtual-test
virtual-test.o  ../../../libgda/.libs/ 
/usr/bin/ld: warning:, needed
by ../../../providers/sqlite/virtual/.libs/, not
found (try using -rpath or -rpath-link)
../../../providers/sqlite/virtual/.libs/ undefined
reference to `gda_sqlite_provider_get_type'
collect2: ld returned 1 exit status
make[3]: *** [virtual-test] Error 1
make[3]: Leaving directory
make[2]: *** [all-recursive] Error 1
make[2]: Leaving directory
make[1]: *** [all-recursive] Error 1
make[1]: Leaving directory
make: *** [all-recursive] Error 1

I got this to compiile ok. Seems I had patched it by accident.


[Date Prev][Date Next]   [Thread Prev][Thread Next]   [Thread Index] [Date Index] [Author Index]