Error during phase build of gnome-shell

freshly updated jhbuild.

$jhbuild info gnome-shell
Name: gnome-shell
Git Module: git://
Git Branch: master
Tree-ID: c2ae95f912f6b36d04a3259fc8f5b0f56b7190f8

moduleset = 'gnome-apps-3.0'
modules = [ 'meta-gnome-core' ]
no other options specified in jhbuildrc.

ran 'jhbuild build --no-network gnome-shell'

Any help is appreciated. I know nothing about mutter.


(mutter:22723): mutter-WARNING **: Could not load library
( cannot open shared object file: No such file or

(mutter:22723): mutter-CRITICAL **: failed to load plugins
failed to dump: Failed to find symbol 'shell_app_get_type'
Command '['mutter',
returned non-zero exit status 1
make[3]: *** [Shell-0.1.gir] Error 1
make[3]: Leaving directory
make[2]: *** [all] Error 2
make[2]: Leaving directory
make[1]: *** [all-recursive] Error 1
make[1]: Leaving directory `/home/bwinfrey/development/gnome/source/gnome-shell'
make: *** [all] Error 2
*** Error during phase build of gnome-shell: ########## Error running
make   *** [70/70]

Thank you,

[Date Prev][Date Next]   [Thread Prev][Thread Next]   [Thread Index] [Date Index] [Author Index]