gnome-applet error during build

When building gnome-applets-1.1.5 or 1.1.6 I get the following error:

gcc -g -O2 -Wall -Wunused -o another_clock_applet another_clock.o -rdynamic -L/usr/lib -L/usr/X11R6/lib -rdynamic -lpanel_applet -lgnorba -lORBitCosNaming -lORBit -lIIOP -lORBitutil -lgnomeui -lart_lgpl -lgdk_imlib -lSM -lICE -lgtk -lgdk -lgmodule -lXext -lX11 -lgnome -lgnomesupport -lesd -laudiofile -lm -ldb -lglib -ldl
another_clock.o: In function `main':
/usr/src/redhat/BUILD/gnome-applets-1.1.5/another_clock/another_clock.c:679: undefined reference to `applet_widget_get_panel_pixel_size'
collect2: ld returned 1 exit status
make[3]: *** [another_clock_applet] Error 1
make[3]: Leaving directory `/usr/src/redhat/BUILD/gnome-applets-1.1.5/another_clock'
make[2]: *** [all-recursive] Error 1
make[2]: Leaving directory `/usr/src/redhat/BUILD/gnome-applets-1.1.5/another_clock'
make[1]: *** [all-recursive] Error 1

any advice will be appreciated.

This occurs from a tar or rpm

Linux, the choice
of a GNU generation  -o)   
Kernel 2.2.14         /\  
on a Dual PII 333    _\_v 

[Date Prev][Date Next]   [Thread Prev][Thread Next]   [Thread Index] [Date Index] [Author Index]