Build chokes on gnome-core

I built each package as per the gnome web site, but when I get to
gnome-core it bails.  Here is the output from when it fails, appreciate
any and all help: In function `char * gnome_panel_applet_request_id(const
char *, const char *, int, int *, char **, char **, unsigned int *)': warning: `catch', `throw', and `try' are all C++
reserved words exception handling disabled, use -fhandle-exceptions
enable. In function `void gnome_panel_applet_cleanup(int)': warning: ANSI C++ forbids implicit conversion from
`void *' in assignment
make[2]: *** [applet-lib.lo] Error 1
make[2]: Leaving directory
make[1]: *** [all-recursive] Error 1
make[1]: Leaving directory `/usr/src/gnome-install/gnome-core-0.13'
make: *** [all-recursive-am] Error 2

"I was playing poker the other night ... with Tarot cards. I got a full
house and four people died."                       -- Steven Wright

[Date Prev][Date Next]   [Thread Prev][Thread Next]   [Thread Index] [Date Index] [Author Index]