compiling gtk


I cant get gtk+ to compile (from CVS) nor the 1.1.0 version from I get:
make[2]: Entering directory `/home/hkelle/GNOME/gtk+/gtk'
/bin/sh ../libtool --mode=compile gcc -DHAVE_CONFIG_H -I. -I. -I.. -I.. -I/usr/local/lib/glib/include -I/usr/local/include  -I/usr/X11R6/include  -g -O2 -DGTK_NO_CHECK_CASTS -Wall -DUSE_XIM -c gtkrc.c
gcc -DHAVE_CONFIG_H -I. -I. -I.. -I.. -I/usr/local/lib/glib/include -I/usr/local/include -I/usr/X11R6/include -g -O2 -DGTK_NO_CHECK_CASTS -Wall -DUSE_XIM -Wp,-MD,.deps/gtkrc.p -c -fPIC -DPIC gtkrc.c
gtkrc.c:147: warning: excess elements in struct initializer after `gtk_rc_scanner_config'
gtkrc.c: In function `gtk_rc_parse_any':
gtkrc.c:597: structure has no member named `scope_id'
gtkrc.c: In function `gtk_rc_parse_state':
gtkrc.c:1196: warning: implicit declaration of function `g_scanner_set_scope'
make[2]: *** [gtkrc.lo] Error 1
make[2]: Leaving directory `/home/hkelle/GNOME/gtk+/gtk'
make[1]: *** [all-recursive] Error 1
make[1]: Leaving directory `/home/hkelle/GNOME/gtk+'
make: *** [all-recursive-am] Error 2

//  Hrafnkell Eiriksson  //  Student of Computer- and Electrical engineering
//     //  at the Univeristy of Iceland
//        //  "Blessed are they who go around in circles,
//  Finger for PGP key   //   for they shall be known as Wheels"

[Date Prev][Date Next]   [Thread Prev][Thread Next]   [Thread Index] [Date Index] [Author Index]