[gnome-db] mergeant cvs build error.

Hopefully this is a relevant mailing list for mergeant. While building
from cvs, with jhbuild's gnome26.modules:

mergeant.c: In function `prepare_app':
mergeant.c:72: warning: implicit declaration of function
mergeant.c:72: warning: assignment makes pointer from integer without a
mergeant.c: In function `main':
mergeant.c:174: warning: implicit declaration of function `setlocale'
mergeant.c:174: `LC_ALL' undeclared (first use in this function)
mergeant.c:174: (Each undeclared identifier is reported only once
mergeant.c:174: for each function it appears in.)
make[3]: *** [mergeant.o] Error 1
make[3]: Leaving directory `/home/murrayc/cvs/gnome26/mergeant/src'
make[2]: *** [all-recursive] Error 1
make[2]: Leaving directory `/home/murrayc/cvs/gnome26/mergeant/src'
make[1]: *** [all-recursive] Error 1
make[1]: Leaving directory `/home/murrayc/cvs/gnome26/mergeant'
make: *** [all-recursive-am] Error 2
*** error during stage build of mergeant: could not build module ***

Murray Cumming
murrayc murrayc com

[Date Prev][Date Next]   [Thread Prev][Thread Next]   [Thread Index] [Date Index] [Author Index]