Re: [Evolution] compilation keeps failing.

Thats only a test program, try 'make -k' so it ignores the error and keeps going.

If you're using some gentoo tool/port system/whatever it is, then try asking whomever made the package for it.

On Sat, 2005-01-22 at 21:59 +0100, relic wrote:
Hi, I have given up on compiling evo and
It just doesnt want to compile on my gentoo installation.

I'am aware of the possible? fact that this is the wrong
mailing list to post about compilation trouble of experimental evo.
But I just can't see the problem with why this fails.

So if someone bright can clue me, I would be thankfull.

This is what gets spawned:

make[4]: Entering directory
/bin/sh ../../libtool --mode=link i686-pc-linux-gnu-gcc
-march=pentium-m -mtune=pentium-m -pipe -O2 -fomit-frame-pointer
-fforce-addr -frename-registers -fprefetch-loop-arrays
-falign-functions=64 -Wall -Wmissing-prototypes  -Wno-sign-compare   -o
test-calendar.o ./ ../../e-util/
-Wl,--export-dynamic -pthread -L/usr/X11R6/lib -lgnomeui-2 -lSM -lICE
-lbonoboui-2 -lgal-2.4 -lgal-a11y-2.4 -lgnomecanvas-2 -lglade-2.0
-lgnomeprint-2-2 -lpangoft2-1.0 -lgtk-x11-2.0 -lgdk-x11-2.0 -latk-1.0
-lgdk_pixbuf-2.0 -lpangoxft-1.0 -lpangox-1.0 -lart_lgpl_2 -lpango-1.0
-lgobject-2.0 -ledataserverui-1.2 -ledataserver-1.2 -lgnome-2 -lpopt
-lxml2 -lpthread -lz -lgnomevfs-2 -lbonobo-2 -lgconf-2
-lbonobo-activation -lORBit-2 -lm -lgmodule-2.0 -ldl -lgthread-2.0
i686-pc-linux-gnu-gcc -march=pentium-m -mtune=pentium-m -pipe -O2
-fomit-frame-pointer -fforce-addr -frename-registers
-fprefetch-loop-arrays -falign-functions=64 -Wall -Wmissing-prototypes
-Wno-sign-compare -o .libs/test-calendar test-calendar.o
-L/usr/X11R6/lib ./.libs/ ../../e-util/.libs/ -pthread /usr/lib/ -lSM -lICE /usr/lib/ /usr/lib/ /usr/lib/ /usr/lib/ /usr/lib/ /usr/lib/ /usr/lib/ /usr/lib/ /usr/lib/ /usr/lib/ /usr/lib/ /usr/lib/ /usr/lib/ /usr/lib/ /usr/lib/ /usr/lib/ /usr/lib/ /usr/lib/ /usr/lib/ /usr/lib/ /usr/lib/ -lpthread -lz /usr/lib/ /usr/lib/ /usr/lib/ /usr/lib/ /usr/lib/ -lm /usr/lib/ -ldl /usr/lib/ /usr/lib/ -Wl,--rpath -Wl,/usr/lib/evolution/2.2./.libs/ undefined reference to `e_combo_button_a11y_init'
collect2: ld returned 1 exit status
make[4]: *** [test-calendar] Error 1
make[4]: Leaving directory
make[3]: *** [all] Error 2
make[3]: Leaving directory
make[2]: *** [all-recursive] Error 1
make[2]: Leaving directory
make[1]: *** [all-recursive] Error 1
make[1]: Leaving directory
make: *** [all] Error 2

englisch is thaught me by a goat,

evolution maillist  -  evolution lists ximian com

[Date Prev][Date Next]   [Thread Prev][Thread Next]   [Thread Index] [Date Index] [Author Index]