[Evolution] Make error from Evolution/CVS


I am getting the following error while compiling evolution from CVS:

select-names/.libs/libeselectnames.so: undefined reference to `e_table_without_show_all'
collect2: ld returned 1 exit status
make[5]: *** [evolution-addressbook] Error 1
make[5]: Leaving directory `/opt/gnome/evolution/addressbook/gui/component'
make[4]: *** [all-recursive] Error 1
make[4]: Leaving directory `/opt/gnome/evolution/addressbook/gui/component'
make[3]: *** [all-recursive] Error 1
make[3]: Leaving directory `/opt/gnome/evolution/addressbook/gui'
make[2]: *** [all-recursive] Error 1
make[2]: Leaving directory `/opt/gnome/evolution/addressbook'
make[1]: *** [all-recursive] Error 1
make[1]: Leaving directory `/opt/gnome/evolution'
make: *** [all-recursive-am] Error 2
[ujwal vedanta evolution]$

Any ideas?



[Date Prev][Date Next]   [Thread Prev][Thread Next]   [Thread Index] [Date Index] [Author Index]