[Evolution] Evolution docs fail to compile

For the past several weeks I've been getting the following compile
error.  To get around it I've been editing the top level Makefile to
forgo documentation, but it's kind of annoying.  Any idea what the
problem is?  Do I need to get gtkdoc from CVS or something?


*** Building SGML ***
cd . && \
gtkdoc-mkdb --module=evolution-cal-util
Unknown option: main-sgml-file
touch sgml-build.stamp
make[5]: Leaving directory
make[5]: Entering directory `/home/dhensley/dev/evh/doc/devel/calendar'
make[5]: Nothing to be done for `all-am'.
make[5]: Leaving directory `/home/dhensley/dev/evh/doc/devel/calendar'
make[4]: Leaving directory `/home/dhensley/dev/evh/doc/devel/calendar'
make[4]: Entering directory `/home/dhensley/dev/evh/doc/devel'
make[4]: *** No rule to make target
`executive-summary/sgml/executive-summary-component.sgml', needed by
`html-build.stamp'.  Stop.
make[4]: Leaving directory `/home/dhensley/dev/evh/doc/devel'
make[3]: *** [all-recursive] Error 1
make[3]: Leaving directory `/home/dhensley/dev/evh/doc/devel'
make[2]: *** [all-recursive] Error 1
make[2]: Leaving directory `/home/dhensley/dev/evh/doc'
make[1]: *** [all-recursive] Error 1
make[1]: Leaving directory `/home/dhensley/dev/evh'
make: *** [all-recursive-am] Error 2

[Date Prev][Date Next]   [Thread Prev][Thread Next]   [Thread Index] [Date Index] [Author Index]