[Evolution] evolution won't compile

I dont see any resolution on this at archives so I"m asking here:

i have most recent helix nd RH7/2.4.00-test9 kernel..

i installed all dependencies mentioned at "readme" before installing evolution
site and
all compile/installed fine..........

but now after all that :) evolution is being stubborn,,,,please see

any help apprecited
Making all in libibex
make[2]: Entering directory `/usr/local/evolution-0.6/libibex'
/bin/sh ../libtool --mode=compile gcc -DHAVE_CONFIG_H -I. -I. -I.. -I.
-I/usr/lib/glib/include -DUNICODE_USE_SYSTEM_ICONV
-DG_LOG_DOMAIN=\"libibex\"  -I/usr/lib/glib/include -I/usr/X11R6/include  -g
-O2 -Wall -Wunused  -c ibex_block.c
rm -f .libs/ibex_block.lo
gcc -DHAVE_CONFIG_H -I. -I. -I.. -I. -I/usr/lib/glib/include
-DUNICODE_USE_SYSTEM_ICONV -DG_LOG_DOMAIN=\"libibex\" -I/usr/lib/glib/include
-I/usr/X11R6/include -g -O2 -Wall -Wunused -c ibex_block.c  -fPIC -DPIC -o
ibex_block.c:4:16: db.h: No such file or directory
ibex_block.c:239:74: warning: pasting would not give a valid preprocessing
make[2]: *** [ibex_block.lo] Error 1
make[2]: Leaving directory `/usr/local/evolution-0.6/libibex'
make[1]: *** [all-recursive] Error 1
make[1]: Leaving directory `/usr/local/evolution-0.6'
make: *** [all-recursive-am] Error 2
[root localhost evolution-0.6]#

[Date Prev][Date Next]   [Thread Prev][Thread Next]   [Thread Index] [Date Index] [Author Index]