[Epiphany] new build error

I am getting the following built against moz cvs around 16/6

(moz 1.5a)

EphyWrapper.cpp: In method `nsresult EphyWrapper::ForceEncoding (const
char *)':
EphyWrapper.cpp:734: no matching function for call to
candidates are: nsresult
nsIMarkupDocumentViewer::SetForceCharacterSet (const PRUnichar *)
make[3]: *** [EphyWrapper.lo] Error 1
make[3]: Leaving directory `/root/epiphany/embed/mozilla'
make[2]: *** [all-recursive] Error 1
make[2]: Leaving directory `/root/epiphany/embed'
make[1]: *** [all-recursive] Error 1
make[1]: Leaving directory `/root/epiphany'
make: *** [all] Error 2
You have new mail in /var/spool/mail/mike

ephi built on wednesday against the same mozilla

[Date Prev][Date Next]   [Thread Prev][Thread Next]   [Thread Index] [Date Index] [Author Index]