[Epiphany] Build error with llatest cvs

I get the following error with latest cvs and cvs mozilla as of monday

.c' || echo './'`prefs-dialog.c
prefs-dialog.c: In function `prefs_dialog_show_help':
prefs-dialog.c:247: parse error before `*'
prefs-dialog.c:256: `help_preferences' undeclared (first use in this
prefs-dialog.c:256: (Each undeclared identifier is reported only once
prefs-dialog.c:256: for each function it appears in.)
make[4]: *** [prefs-dialog.o] Error 1
make[4]: Leaving directory `/home/mike/epiphany/src'
make[3]: *** [all-recursive] Error 1
make[3]: Leaving directory `/home/mike/epiphany/src'
make[2]: *** [all] Error 2
make[2]: Leaving directory `/home/mike/epiphany/src'
make[1]: *** [all-recursive] Error 1
make[1]: Leaving directory `/home/mike/epiphany'
make: *** [all] Error 2

[Date Prev][Date Next]   [Thread Prev][Thread Next]   [Thread Index] [Date Index] [Author Index]