troubles with 2.0.6 on a fresh install, and installing 2.0.11 non-root

so, back after some travels, and my sysadmins installed
RH9 on my desktop, so i thought it would be great to see
the balsa 2.0.x series in action.  hmph.  2.0.6 is the
version we have installed, and it is completely broken
for me.  i have never even been able to get through a
complete session (where it scans the entire contents of
all of my mail directory) without it hanging/freezing.

so, i thought, well, i'll just upgrade to 2.0.11.  but our
sysadmins are a bit busy right now upgrading about 100 other
machines to RH9, so i thought i'd do it myself.  i followed
the instructions from mike harris (see, e.g., ), to do a non-root
rpm build, and sucked over balsa-2.0.11-1.src.rpm from, and did: 
%rpmbuild --recompile balsa-2.0.11-1.src.rpm

whoops.  doesn't seem to be set up for non-root builds, which
is, i suspect a problem in the rpm files.  anyway, here is
the set of error messages i get at the end - any guidance on

gcc -O2 -g -march=i386 -mcpu=i686 -o balsa address-book-config.o ab-window.o balsa-app.o balsa-icons.o balsa-index-threading.o balsa-index.o balsa-mblist.o balsa-message.o expand-alias.o filter-edit-callbacks.o filter-edit-dialog.o filter-export-callbacks.o filter-export-dialog.o filter-run-callbacks.o filter-run-dialog.o folder-conf.o information-dialog.o mailbox-conf.o mailbox-node.o main-window.o main.o message-window.o pref-manager.o print.o quote-color.o save-restore.o sendmsg-window.o spell-check.o store-address.o toolbar-factory.o toolbar-prefs.o -pthread -Wl,--export-dynamic -pthread -Wl,--export-dynamic ../libbalsa/libbalsa.a ../libmutt/imap/libimap.a ../libmutt/libmutt.a ../libinit_balsa/libinit_balsa.a -L/usr/X11R6/lib -lgnomeui-2 -lSM -lICE -lbonoboui-2 -lgnome-2 -lgconf-2 -lgnomevfs-2 -lgtkhtml-2 -lgnomeprintui-2 -lgnomeprint-2 -lgnomecanvas-2 /usr/lib/ -lbonobo-2 -lbonobo-activation -lORBit-2 /usr/lib/ -lgthread-2.0 -lart_lgpl_2 -lpangoft2-1!
 .0 -lgtk-x11-2.0 -lgdk-x11-2.0 -latk-1.0 -lgdk_pixbuf-2.0 -lpangoxft-1.0 -lpangox-1.0 -lpango-1.0 -lgobject-2.0 -lgmodule-2.0 -lglib-2.0 -L/usr/local/lib /usr/local/lib/ /usr/local/lib/ -L/usr/kerberos/lib -lssl -lcrypto -lresolv -lgssapi_krb5 -lkrb5 -lk5crypto -lcom_err -lz /usr/lib/ /usr/lib/ -ldl -L/usr/src/build/208958-i386/BUILD/pspell-.12.2/modules/.libs /usr/lib/ -L/usr/lib/gcc-lib/i386-redhat-linux/3.2.1 -L/usr/lib/gcc-lib/i386-redhat-linux/3.2.1/../../.. -lstdc++ -lm -lc -lgcc_s -lpthread -lesmtp -Wl,--rpath -Wl,/usr/local/lib -Wl,--rpath -Wl,/usr/local/lib
/usr/bin/ld: cannot find -lgcc_s
collect2: ld returned 1 exit status
make[2]: *** [balsa] Error 1
make[2]: Leaving directory
make[1]: *** [all-recursive] Error 1
make[1]: Leaving directory
make: *** [all-recursive-am] Error 2
error: Bad exit status from
/home/planetas3/linuxapps/rpmbuild/tmp/rpm-tmp.58719 (%build)
RPM build errors:
    user pawsa does not exist - using root
    group pawsa does not exist - using root
    user pawsa does not exist - using root
    group pawsa does not exist - using root
    Bad exit status from
/home/planetas3/linuxapps/rpmbuild/tmp/rpm-tmp.58719 (%build)

[Date Prev][Date Next]   [Thread Prev][Thread Next]   [Thread Index] [Date Index] [Author Index]