problem compiling anon cvs

gcc: ./nautilus-view-component-stubs.c: No such file or directory
gcc: No input files
make[3]: *** [nautilus-view-component-stubs.lo] Error 1
make[3]: Leaving directory `/root/nautilus/libnautilus'
make[2]: *** [all] Error 2
make[2]: Leaving directory `/root/nautilus/libnautilus'
make[1]: *** [all-recursive] Error 1
make[1]: Leaving directory `/root/nautilus'
make: *** [all] Error 2

any ideas why i get these errors? I don't seem to have that missing file
obviously. I downloaded anon cvs this morn.


[Date Prev][Date Next]   [Thread Prev][Thread Next]   [Thread Index] [Date Index] [Author Index]