Re: [Nautilus-list] nautilus 1.0.1 compilation problems
- From: Matthew Walton <mxw00u cs nott ac uk>
- To: Alesh Mustar <alesh sportina si>
- Cc: nautilus-list eazel com
- Subject: Re: [Nautilus-list] nautilus 1.0.1 compilation problems
- Date: Mon, 09 Apr 2001 15:16:25 +0000
It looks like there are some files missing from your tarball - I find it
hard to believe make has to generate nautilus-audio-player.h. I seem to
recall something on this list before about missing files in 1.0.1 -
anyone remember that? And isn't 1.0.2 out now? If it is, maybe you could
try that, either that or someone should know where to find the missing
files.
Alesh Mustar wrote:
Hello,
I'm having troubles compiling Nautilius-1.0.1.
Distribution is Slackware 7.1, with gnome 1.4.
./configure runs ok, but then i get this problem with make:
gcc -DHAVE_CONFIG_H -I. -I. -I../.. -I../.. -I../..
-I../../cut-n-paste-code -I/usr/local/include -DNEED_GNOMESUPPORT_H
-I/usr/local/lib/gnome-libs/include -I/usr/local/include/gtk-1.2
-I/usr/lib/glib/include -I/usr/X11R6/include
-I/usr/local/include/glib-1.2 -I/usr/local/lib/glib/include
-I/usr/local/include/gnome-xml -I/usr/local/include
-I/usr/local/include/glib-1.2 -I/usr/local/lib/glib/include
-I/usr/local/include -DNEED_GNOMESUPPORT_H
-I/usr/local/lib/gnome-libs/include -I/usr/local/include/gtk-1.2
-I/usr/lib/glib/include -I/usr/X11R6/include
-I/usr/local/include/gtk-1.2 -I/usr/local/include/glib-1.2
-I/usr/local/lib/glib/include -I/usr/X11R6/include
-I/usr/local/include -I/usr/local/lib/vfs/include
-I/usr/local/include/glib-1.2 -I/usr/local/lib/glib/include
-D_REENTRANT -DVERSION=\"1.0.1\" -D_REENTRANT
-DNAUTILUS_DATADIR=\"/usr/local/share/nautilus\"
-DDATADIR=\"/usr/local/share\" -g -O2 -c fm-icon-text-window.c -fPIC
-DPIC -o fm-icon-text-window.lo
make[3]: *** No rule to make target
`../../libnautilus-extensions/nautilus-audio-player.h', needed by
`fm-icon-view.lo'. Stop.
make[3]: Leaving directory
`/root/temp/gnome-1.4/core/nautilus-1.0.1/src/file-manager'
make[2]: *** [all-recursive] Error 1
make[2]: Leaving directory `/root/temp/gnome-1.4/core/nautilus-1.0.1/src'
make[1]: *** [all-recursive] Error 1
make[1]: Leaving directory `/root/temp/gnome-1.4/core/nautilus-1.0.1'
make: *** [all-recursive-am] Error 2
<mailto:root alesh:~/temp/gnome-1.4/core/nautilus-1.0.1#>
Any ideas, suggestions are more then welcome!
Thank you in advance,
Alesh Mustar
[
Date Prev][
Date Next] [
Thread Prev][
Thread Next]
[
Thread Index]
[
Date Index]
[
Author Index]