[Evolution-hackers] error in evolution compilation


I've tried compiling evolution 2. So far, no luck. I get the following

make[3]: Leaving directory `/usr/local/src/evolution/evolution-2.0.0/tools'
make[2]: Leaving directory `/usr/local/src/evolution/evolution-2.0.0/tools'
Making all in help
make[2]: Entering directory `/usr/local/src/evolution/evolution-2.0.0/help'
Making all in C
make[3]: Entering directory
make[3]: *** No rule to make target `evolution-2.0.xml', needed by
`all'.  Stop.
make[3]: Leaving directory `/usr/local/src/evolution/evolution-2.0.0/help/C'
make[2]: *** [all-recursive] Error 1
make[2]: Leaving directory `/usr/local/src/evolution/evolution-2.0.0/help'
make[1]: *** [all-recursive] Error 1
make[1]: Leaving directory `/usr/local/src/evolution/evolution-2.0.0'
make: *** [all] Error 2

Googleing for it didn't help :(( (Usually Does!)

Has anyone experienced similar issues? Anyway of solving this?

Thanks for any help

Andrei Mikhailovsky

[Date Prev][Date Next]   [Thread Prev][Thread Next]   [Thread Index] [Date Index] [Author Index]