[Epiphany] another build error

this comes from mozilla wed and gnome cvs tuesday (24/6)

editable-toolbar.lo -MD -MP -MF .deps/egg-editable-toolbar.Tpo -c
egg-editable-toolbar.c  -fPIC -DPIC -o egg-editable-toolbar.lo
egg-editable-toolbar.c: In function `set_item_drag_source':
egg-editable-toolbar.c:318: parse error before `*'
egg-editable-toolbar.c:319: `pixbuf' undeclared (first use in this
egg-editable-toolbar.c:319: (Each undeclared identifier is reported only
egg-editable-toolbar.c:319: for each function it appears in.)
make[4]: *** [egg-editable-toolbar.lo] Error 1
make[4]: Leaving directory `/root/epiphany/lib/egg'
make[3]: *** [all-recursive] Error 1
make[3]: Leaving directory `/root/epiphany/lib'
make[2]: *** [all] Error 2
make[2]: Leaving directory `/root/epiphany/lib'
make[1]: *** [all-recursive] Error 1
make[1]: Leaving directory `/root/epiphany'
make: *** [all] Error 2

looks like a gnome error - but I may be wrong

[Date Prev][Date Next]   [Thread Prev][Thread Next]   [Thread Index] [Date Index] [Author Index]