ORBit-2.la not found


after upgrading to the latest ORBit2 snapshots from Ximian I get the
following error when building nautilus:

grep: /usr/lib/libORBit-2.la: No such file or directory
sed: can't read /usr/lib/libORBit-2.la: No such file or directory
libtool: link: `/usr/lib/libORBit-2.la' is not a valid libtool archive
make[2]: *** [libnautilus-private.la] Error 1
make[2]: Leaving directory
make[1]: *** [all-recursive] Error 1
make[1]: Leaving directory `/gnome/head/cvs/nautilus'
make: *** [all-recursive-am] Error 2

Looks like the RPMs didn't include the .la files.

- Frank

[Date Prev][Date Next]   [Thread Prev][Thread Next]   [Thread Index] [Date Index] [Author Index]