Compile problems with Balsa 1.1.2


Normally I don't have any problems compiling Balsa, but this time around I'm
receiving this error:

balsa-initdruid.c:91:41: nothing can be pasted after this token
balsa-initdruid.c:93:51: nothing can be pasted after this token
make[2]: *** [balsa-initdruid.o] Error 1
make[2]: Leaving directory `/usr/src/balsa-1.1.2/libinit_balsa'
make[1]: *** [all-recursive] Error 1
make[1]: Leaving directory `/usr/src/balsa-1.1.2'
make: *** [all-recursive-am] Error 2

I checked that my gnome-libs match what's recommended in the Readme/Install
file, is there something else I need to make sure is updated?  


[Date Prev][Date Next]   [Thread Prev][Thread Next]   [Thread Index] [Date Index] [Author Index]